Home - Waterfall Grid T-Grid Console Builders Recent Builds Buildslaves Changesources - JSON API - About

Builder mips_mips32 Build #245

Results:

Build successful

SourceStamp:

Repositoryhttps://git.openwrt.org/feed/telephony.git
Branchmaster
Revisionfffc4678c8700e69238606c7f91548c0533ecee8
Changes2 changes

BuildSlave:

truecz-dock-01

Reason:

The SingleBranchScheduler scheduler named 'all' triggered this build

Steps and Logfiles:

  1. sharedwd Setting up shared work directory ( 0 secs )
    1. - no logs -
  2. nproc property 'nproc' set ( 0 secs )
    1. - no logs -
  3. download downloading to cleanup.sh ( 0 secs )
    1. - no logs -
  4. cleanold Cleaning previous builds ( 17 secs )
    1. - no logs -
  5. cleanup Cleaning work area ( 0 secs )
    1. - no logs -
  6. mksdkdir Preparing SDK directory ( 0 secs )
    1. - no logs -
  7. downloadsdk Downloading SDK archive ( 2 secs )
    1. - no logs -
  8. unpacksdk Unpacking SDK archive ( 6 secs )
    1. - no logs -
  9. updatesdk Updating SDK ( 2 secs )
    1. - no logs -
  10. cleancmdlinks Sanitizing host command symlinks ( 0 secs )
    1. - no logs -
  11. writeversionmk downloading to getversion.mk ( 0 secs )
    1. - no logs -
  12. getversion property 'release_version' set ( 0 secs )
    1. - no logs -
  13. dlkeybuildpub downloading to key-build.pub ( 0 secs )
    1. - no logs -
  14. dlkeybuild downloading to key-build ( 0 secs )
    1. - no logs -
  15. dlkeybuilducert downloading to key-build.ucert ( 0 secs )
    1. - no logs -
  16. mkdldir Preparing download directory ( 0 secs )
    1. - no logs -
  17. mkconf Preparing SDK configuration ( 6 secs )
    1. - no logs -
  18. download_1 downloading to ccache.sh ( 0 secs )
    1. - no logs -
  19. prepccache Preparing ccache ( 0 secs )
    1. - no logs -
  20. updatefeeds Updating feeds ( 33 secs )
    1. - no logs -
  21. installfeeds Installing feeds ( 5 secs )
    1. - no logs -
  22. logclear Clearing failure logs ( 0 secs )
    1. - no logs -
  23. compile Building packages ( 3 hrs, 29 mins, 32 secs )
    1. - no logs -
  24. mkfeedsconf Generating pinned feeds.conf ( 0 secs )
    1. - no logs -
  25. signprepare Ran ( 0 secs )
    1. - no logs -
  26. signpack Packing files to sign ( 0 secs )
    1. - no logs -
  27. upload uploading sign.tar.gz ( 0 secs )
    1. - no logs -
  28. signfiles Ran ( 2 secs )
    1. - no logs -
  29. download_2 downloading to sign.tar.gz ( 0 secs )
    1. - no logs -
  30. signunpack Unpacking signed files ( 0 secs )
    1. - no logs -
  31. uploadprepare Preparing package directory ( 0 secs )
    1. - no logs -
  32. packageupload Uploading package files ( 1 mins, 39 secs )
    1. - no logs -
  33. logprepare Preparing log directory ( 0 secs )
    1. - no logs -
  34. logfind Finding failure logs ( 0 secs )
    1. - no logs -
  35. logcollect Collecting failure logs ( 0 secs )
    1. - no logs -
  36. logupload Uploading failure logs ( 2 secs )
    1. - no logs -
  37. sourcelist Finding source archives to upload ( 0 secs )
    1. - no logs -
  38. sourceupload Uploading source archives ( 0 secs )
    1. - no logs -
  39. df Reporting disk usage ( 0 secs )
    1. - no logs -

Build Properties:

NameValueSource
branch master Build
builddir /builder/mips_mips32 slave
buildername mips_mips32 Builder
buildnumber 245 Build
codebase Build
nproc 8 SetPropertyFromCommand Step
project Build
release_version SNAPSHOT SetPropertyFromCommand Step
repository https://git.openwrt.org/feed/telephony.git Build
revision fffc4678c8700e69238606c7f91548c0533ecee8 Build
scheduler all Scheduler
shared_wd True BuildSlave
slavename truecz-dock-01 BuildSlave
workdir /builder/mips_mips32 slave (deprecated)

Forced Build Properties:

NameLabelValue

Responsible Users:

  1. Sebastian Kemper
  2. micmac1

Timing:

StartMon May 18 11:45:00 2020
EndMon May 18 15:17:33 2020
Elapsed3 hrs, 32 mins, 33 secs

All Changes:

:

  1. Change #9267

    Category None
    Changed by Sebastian Kemper <sebastian_mlohnoyoudont@gmx.net>
    Changed at Wed 13 May 2020 16:27:43
    Repository https://git.openwrt.org/feed/telephony.git
    Branch master
    Revision 439cff8707b5f245a97d9d4142046f6d06c622e0

    Comments

    freeswitch-stable: disable sofia-sip tests
    Upstream commit 2dced93 "[sofia-sip] Build internal tests" enabled the
    building of tests. One of them causes build failures on the build bots:
    
    Making all in s2check
    make[11]: Entering directory '/builder/shared-workdir/build/sdk/build_dir/target-arm_cortex-a15+neon-vfpv4_musl_eabi/freeswitch-1.10.3.-release/libs/sofia-sip/s2check'
             COMPILE s2tcase.o
    s2tcase.c: In function 's2_tcase_add_test':
    s2tcase.c:60:27: error: passing argument 2 of '_tcase_add_test' from incompatible pointer type [-Werror=incompatible-pointer-types]
           _tcase_add_test(tc, tf, name, signo, 0, start, end);
                               ^~
    In file included from s2tcase.c:35:
    /builder/shared-workdir/build/sdk/staging_dir/target-arm_cortex-a15+neon-vfpv4_musl_eabi/usr/include/check.h:331:69: note: expected 'const TTest *' {aka 'const struct TTest *'} but argument is of type 'TFun' {aka 'void (*)(int)'}
     CK_DLL_EXP void CK_EXPORT _tcase_add_test(TCase * tc, const TTest * ttest,
                                                           ~~~~~~~~~~~~~~^~~~~
    s2tcase.c:60:31: error: passing argument 3 of '_tcase_add_test' makes integer from pointer without a cast [-Werror=int-conversion]
           _tcase_add_test(tc, tf, name, signo, 0, start, end);
                                   ^~~~
    In file included from s2tcase.c:35:
    /builder/shared-workdir/build/sdk/staging_dir/target-arm_cortex-a15+neon-vfpv4_musl_eabi/usr/include/check.h:332:47: note: expected 'int' but argument is of type 'const char *'
                                               int _signal, int allowed_exit_value,
                                               ~~~~^~~~~~~
    s2tcase.c:60:7: error: too many arguments to function '_tcase_add_test'
           _tcase_add_test(tc, tf, name, signo, 0, start, end);
           ^~~~~~~~~~~~~~~
    In file included from s2tcase.c:35:
    /builder/shared-workdir/build/sdk/staging_dir/target-arm_cortex-a15+neon-vfpv4_musl_eabi/usr/include/check.h:331:27: note: declared here
     CK_DLL_EXP void CK_EXPORT _tcase_add_test(TCase * tc, const TTest * ttest,
                               ^~~~~~~~~~~~~~~
    cc1: all warnings being treated as errors
    
    I can't reproduce this at home. Not with a master checkout, not with a
    current SDK. But the tests are not needed for the OpenWrt packages
    anyway, so this commit disables them again.
    
    No rev bump is done because this has no effect on the packages.
    
    Signed-off-by: Sebastian Kemper <sebastian_ml@gmx.net>

    Changed files

    • net/freeswitch-stable/patches/400-disable-sofia-sip-tests.patch
  2. Change #9268

    Category None
    Changed by micmac1 <sebastian_mlohnoyoudont@gmx.net>
    Changed at Wed 13 May 2020 16:38:24
    Repository https://git.openwrt.org/feed/telephony.git
    Branch master
    Revision fffc4678c8700e69238606c7f91548c0533ecee8

    Comments

    Merge pull request #530 from micmac1/fs1103-no-sofia-tests
    freeswitch-stable: disable sofia-sip tests

    Changed files

    • no files