(view as text)
make -j5 'IGNORE_ERRORS=n m y' BUILD_LOG=1 CONFIG_AUTOREMOVE=y CONFIG_SIGNED_PACKAGES=
 in dir /builder/mipsel_74kc/build/sdk (timeout 3600 secs)
 watching logfiles {}
 argv: ['make', '-j5', 'IGNORE_ERRORS=n m y', 'BUILD_LOG=1', 'CONFIG_AUTOREMOVE=y', 'CONFIG_SIGNED_PACKAGES=']
 environment:
  CCACHE_BASEDIR=/builder/mipsel_74kc
  HOME=/builder
  HOSTNAME=34db47c3ecd2
  LANG=en_US.utf8
  PATH=/usr/local/sbin:/usr/local/bin:/usr/sbin:/usr/bin:/sbin:/bin
  PWD=/builder/mipsel_74kc/build/sdk
  SHLVL=1
 using PTY: False
Checking 'working-make'... ok.
Checking 'case-sensitive-fs'... ok.
Checking 'proper-umask'... ok.
Checking 'gcc'... ok.
Checking 'working-gcc'... ok.
Checking 'g++'... ok.
Checking 'working-g++'... ok.
Checking 'ncurses'... ok.
Checking 'perl-thread-queue'... ok.
Checking 'tar'... ok.
Checking 'find'... ok.
Checking 'bash'... ok.
Checking 'patch'... ok.
Checking 'diff'... ok.
Checking 'cp'... ok.
Checking 'seq'... ok.
Checking 'awk'... ok.
Checking 'grep'... ok.
Checking 'getopt'... ok.
Checking 'stat'... ok.
Checking 'unzip'... ok.
Checking 'bzip2'... ok.
Checking 'wget'... ok.
Checking 'perl'... ok.
Checking 'python2-cleanup'... ok.
Checking 'python'... failed.
Checking 'python3'... failed.
Checking 'git'... ok.
Checking 'file'... ok.
Checking 'ldconfig-stub'... ok.

Build dependency: Please install Python >= 3.5
Build dependency: Please install Python >= 3.5

/builder/shared-workdir/build/sdk/include/prereq.mk:12: recipe for target 'prereq' failed
Prerequisite check failed. Use FORCE=1 to override.
/builder/shared-workdir/build/sdk/include/toplevel.mk:167: recipe for target 'staging_dir/host/.prereq-build' failed
make[2]: *** [staging_dir/host/.prereq-build] Error 1
/builder/shared-workdir/build/sdk/include/toplevel.mk:83: recipe for target 'prepare-tmpinfo' failed
make[1]: *** [prepare-tmpinfo] Error 2
/builder/shared-workdir/build/sdk/include/toplevel.mk:209: recipe for target 'world' failed
make: *** [world] Error 2
program finished with exit code 2
elapsedTime=0.375691